Reaction Details
TargetTyrosine-protein kinase BTK
LigandBDBM362394
Substrate/Competitorn/a
Meas. Tech.Enzyme Activity Assay
IC50 0.860±n/a nM
Citation Liu, JKim, RMKozlowski, JGuiadeen, DKrikorian, ADYu, Y BTK inhibitors US Patent US9834554 Publication Date 12/5/2017
 
Tyrosine-protein kinase BTK
Name:Tyrosine-protein kinase BTK
Type:Enzyme
Mol. Mass.:76289.95
Organism:Homo sapiens (Human)
Description:Q06187
Residue:659
BDBM362394
NameBDBM362394
Synonyms:4-{7-amino-3-[(3R)-1- (cyclopropylcarbonyl)piperidin-3-yl]- 1H-pyrazolo[3,4-c]pyridin-1- yl}-N-[4-(trifluoromethyl)pyridin- 2-yl]benzamide | US9834554, Example 24
TypeSmall organic molecule
Emp. Form.C28H26F3N7O2
Mol. Mass.549.5469
SMILESNc1nccc2c(nn(-c3ccc(cc3)C(=O)Nc3cc(ccn3)C(F)(F)F)c12)[C@@H]1CCCN(C1)C(=O)C1CC1