Reaction Details
TargetTyrosine-protein kinase SYK
LigandBDBM243347
Substrate/Competitorn/a
Meas. Tech.In Vitro SYK Inhibition Assay
pH7.8±n/a
Temperature298.15±n/a K
IC50<500±n/a nM
Commentsextracted
Citation Benjahad, AMartin, JSchalon, CPez, DChevenier, ESandrinelli, FPicoul, WMoussy, A Diazaspiroalkaneone-substituted oxazole derivatives as spleen tyrosine kinase inhibitors US Patent US10053455 Publication Date 8/21/2018
 
Tyrosine-protein kinase SYK
Name:Tyrosine-protein kinase SYK
Type:Enzyme
Mol. Mass.:72079.99
Organism:Homo sapiens (Human)
Description:P43405
Residue:635
BDBM243347
NameBDBM243347
Synonyms:4-{5-[3-Morpholin-4- ylmethy1-5-(4- trifluoromethyl-pyrimidin- 2-ylamino)-phenyl]- oxazol-2-yl}-4,7-diaza- spiro[2.5]octan-8-one | US10053455, 003
TypeSmall organic molecule
Emp. Form.C25H26F3N7O3
Mol. Mass.529.5142
SMILESFC(F)(F)c1ccnc(Nc2cc(CN3CCOCC3)cc(c2)-c2cnc(o2)N2CCNC(=O)C22CC2)n1