Reaction Details
TargetTyrosine-protein kinase SYK
LigandBDBM243358
Substrate/Competitorn/a
Meas. Tech.In Vitro SYK Inhibition Assay
pH7.8±n/a
Temperature298.15±n/a K
IC50>2000±n/a nM
Commentsextracted
Citation Benjahad, AMartin, JSchalon, CPez, DChevenier, ESandrinelli, FPicoul, WMoussy, A Diazaspiroalkaneone-substituted oxazole derivatives as spleen tyrosine kinase inhibitors US Patent US10053455 Publication Date 8/21/2018
 
Tyrosine-protein kinase SYK
Name:Tyrosine-protein kinase SYK
Type:Enzyme
Mol. Mass.:72079.99
Organism:Homo sapiens (Human)
Description:P43405
Residue:635
BDBM243358
NameBDBM243358
Synonyms:4-{5-[3-(4-Morpholin-4- yl-pyrimidin-2-ylamino)- phenyl]-oxazol-2-yl}-4,7- diaza-spiro[2.5]octan-8- one | US10053455, 014
TypeSmall organic molecule
Emp. Form.C23H25N7O3
Mol. Mass.447.4897
SMILESO=C1NCCN(c2ncc(o2)-c2cccc(Nc3nccc(n3)N3CCOCC3)c2)C11CC1