Reaction Details
TargetCathepsin S
LigandBDBM19649
Substrate/CompetitorBDBM19546
Meas. Tech.Enzyme Inhibition Assay
pH5.5±n/a
Temperature310.15±n/a K
Ki 5±n/a nM
Citation Chatterjee, AKLiu, HTully, DCGuo, JEpple, RRusso, RWilliams, JRoberts, MTuntland, TChang, JGordon, PHollenbeck, TTumanut, CLi, JHarris, JL Synthesis and SAR of succinamide peptidomimetic inhibitors of cathepsin S. Bioorg Med Chem Lett17:2899-903 (2007) 
 
Cathepsin S
Name:Cathepsin S
Type:Protein
Mol. Mass.:37507.38
Organism:Homo sapiens (Human)
Description:P25774
Residue:331
BDBM19649
BDBM19546
NameBDBM19649
Synonyms:(2R)-2-(cyclohexylmethyl)-N-[(2S)-4-methanesulfonyl-1-{[4-(trifluoromethoxy)phenyl]amino}butan-2-yl]-4-(morpholin-4-yl)-4-oxobutanamide | succinamide peptidomimetic, 15
TypeSmall organic molecule
Emp. Form.C27H40F3N3O6S
Mol. Mass.591.683
SMILESCS(=O)(=O)CC[C@@H](CNc1ccc(OC(F)(F)F)cc1)NC(=O)[C@H](CC1CCCCC1)CC(=O)N1CCOCC1