Reaction Details
TargetPhosphatidylinositol 4,5-bisphosphate 3-kinase catalytic subunit delta isoform
LigandBDBM362683
Substrate/Competitorn/a
Meas. Tech.Biochemical Assay
IC50 8.00±n/a nM
Citation Du, ZHintermann, SHurth, KJacquier, SLehmann, HMoebitz, HSoldermann, NStojanovic, A Substituted quinazolin-4-one derivatives US Patent US9840498 Publication Date 12/12/2017
 
Phosphatidylinositol 4,5-bisphosphate 3-kinase catalytic subunit delta isoform
Name:Phosphatidylinositol 4,5-bisphosphate 3-kinase catalytic subunit delta isoform
Type:Enzyme Subunit
Mol. Mass.:119489.41
Organism:Homo sapiens (Human)
Description:O00329
Residue:1044
BDBM362683
NameBDBM362683
Synonyms:US9840498, 9
TypeSmall organic molecule
Emp. Form.C28H23FN8O3S
Mol. Mass.570.597
SMILESCOc1ncc(s1)-c1c(F)ccc2nc([C@@H]3C[C@H](O)CN3c3nc(N)nc(C)c3C#N)n(-c3ccccc3)c(=O)c12