Reaction Details
TargetPhosphatidylinositol 4,5-bisphosphate 3-kinase catalytic subunit delta isoform
LigandBDBM362692
Substrate/Competitorn/a
Meas. Tech.Biochemical Assay
IC50 14.0±n/a nM
Citation Du, ZHintermann, SHurth, KJacquier, SLehmann, HMoebitz, HSoldermann, NStojanovic, A Substituted quinazolin-4-one derivatives US Patent US9840498 Publication Date 12/12/2017
 
Phosphatidylinositol 4,5-bisphosphate 3-kinase catalytic subunit delta isoform
Name:Phosphatidylinositol 4,5-bisphosphate 3-kinase catalytic subunit delta isoform
Type:Enzyme Subunit
Mol. Mass.:119489.41
Organism:Homo sapiens (Human)
Description:O00329
Residue:1044
BDBM362692
NameBDBM362692
Synonyms:US9840498, 18
TypeSmall organic molecule
Emp. Form.C30H26N8O2
Mol. Mass.530.5798
SMILESCOc1cncc(c1)-c1cccc2nc([C@@H]3CCCN3c3nc(N)nc(C)c3C#N)n(-c3ccccc3)c(=O)c12