Reaction Details
TargetCathepsin S
LigandBDBM19700
Substrate/CompetitorBDBM19546
Meas. Tech.Enzyme Inhibition Assay
pH5.5±n/a
Temperature310.15±n/a K
Ki 11±n/a nM
Citation Tully, DCLiu, HChatterjee, AKAlper, PBEpple, RWilliams, JARoberts, MJWoodmansee, DHMasick, BTTumanut, CLi, JSpraggon, GHornsby, MChang, JTuntland, THollenbeck, TGordon, PHarris, JLKaranewsky, DS Synthesis and SAR of arylaminoethyl amides as noncovalent inhibitors of cathepsin S: P3 cyclic ethers. Bioorg Med Chem Lett16:5112-7 (2006) 
 
Cathepsin S
Name:Cathepsin S
Type:Protein
Mol. Mass.:37507.38
Organism:Homo sapiens (Human)
Description:P25774
Residue:331
BDBM19700
BDBM19546
NameBDBM19700
Synonyms:(2S)-3-cyclohexyl-N-(2-{[4-(trifluoromethoxy)phenyl]amino}ethyl)-2-({5-[3-(trifluoromethyl)phenyl]furan-2-yl}formamido)propanamide | arylaminoethyl amide deriv. 14
TypeSmall organic molecule
Emp. Form.C30H31F6N3O4
Mol. Mass.611.5753
SMILESFC(F)(F)Oc1ccc(NCCNC(=O)[C@H](CC2CCCCC2)NC(=O)c2ccc(o2)-c2cccc(c2)C(F)(F)F)cc1