Reaction Details
TargetCathepsin S
LigandBDBM19707
Substrate/CompetitorBDBM19546
Meas. Tech.Enzyme Inhibition Assay
pH5.5±n/a
Temperature310.15±n/a K
Ki 18±n/a nM
Citation Tully, DCLiu, HChatterjee, AKAlper, PBEpple, RWilliams, JARoberts, MJWoodmansee, DHMasick, BTTumanut, CLi, JSpraggon, GHornsby, MChang, JTuntland, THollenbeck, TGordon, PHarris, JLKaranewsky, DS Synthesis and SAR of arylaminoethyl amides as noncovalent inhibitors of cathepsin S: P3 cyclic ethers. Bioorg Med Chem Lett16:5112-7 (2006) 
 
Cathepsin S
Name:Cathepsin S
Type:Protein
Mol. Mass.:37507.38
Organism:Homo sapiens (Human)
Description:P25774
Residue:331
BDBM19707
BDBM19546
NameBDBM19707
Synonyms:(2S)-3-cyclohexyl-2-[(2R)-oxolan-2-ylformamido]-N-[(2S)-1-{[4-(trifluoromethoxy)phenyl]amino}propan-2-yl]propanamide | arylaminoethyl amide deriv. 21
TypeSmall organic molecule
Emp. Form.C24H34F3N3O4
Mol. Mass.485.5397
SMILESC[C@@H](CNc1ccc(OC(F)(F)F)cc1)NC(=O)[C@H](CC1CCCCC1)NC(=O)[C@H]1CCCO1