Reaction Details
TargetCathepsin K
LigandBDBM19732
Substrate/CompetitorBDBM19485
Meas. Tech.Enzyme Inhibition Assay
pH7±n/a
Temperature295.15±n/a K
IC50 0.022±n/a nM
Km35000±n/a nM
Citation Altmann, EAichholz, RBetschart, CBuhl, TGreen, JIrie, OTeno, NLattmann, RTintelnot-Blomley, MMissbach, M 2-Cyano-pyrimidines: a new chemotype for inhibitors of the cysteine protease cathepsin K. J Med Chem50:591-4 (2007) 
 
Cathepsin K
Name:Cathepsin K
Type:Enzyme
Mol. Mass.:36975.68
Organism:Homo sapiens (Human)
Description:P43235
Residue:329
BDBM19732
BDBM19485
NameBDBM19732
Synonyms:2-Cyano-pyrimidine, 16b | 2-cyano-4-(cyclohexylamino)-N-[2-(4-methoxyphenyl)ethyl]pyrimidine-5-carboxamide
TypeSmall organic molecule
Emp. Form.C21H25N5O2
Mol. Mass.379.4555
SMILESCOc1ccc(CCNC(=O)c2cnc(nc2NC2CCCCC2)C#N)cc1