Reaction Details
TargetProcathepsin L
LigandBDBM19731
Substrate/CompetitorBDBM19485
Meas. Tech.Enzyme Inhibition Assay
pH5.5±n/a
Temperature295.15±n/a K
IC50 1.1±n/a nM
Km850±n/a nM
Citation Altmann, EAichholz, RBetschart, CBuhl, TGreen, JIrie, OTeno, NLattmann, RTintelnot-Blomley, MMissbach, M 2-Cyano-pyrimidines: a new chemotype for inhibitors of the cysteine protease cathepsin K. J Med Chem50:591-4 (2007) 
 
Procathepsin L
Name:Procathepsin L
Type:Enzyme
Mol. Mass.:37557.19
Organism:Homo sapiens (Human)
Description:Purchased from Calbiochem (San Diego, CA).
Residue:333
BDBM19731
BDBM19485
NameBDBM19731
Synonyms:2-Cyano-pyrimidine, 16a CHEMBL386506
TypeSmall organic molecule
Emp. Form.C20H23N5O
Mol. Mass.349.4295
SMILESO=C(NCCc1ccccc1)c1cnc(nc1NC1CCCCC1)C#N