Reaction Details
TargetProcathepsin L
LigandBDBM19742
Substrate/CompetitorBDBM19485
Meas. Tech.Enzyme Inhibition Assay
pH5.5±n/a
Temperature295.15±n/a K
IC50 1.7±n/a nM
Km850±n/a nM
Citation Altmann, EAichholz, RBetschart, CBuhl, TGreen, JIrie, OTeno, NLattmann, RTintelnot-Blomley, MMissbach, M 2-Cyano-pyrimidines: a new chemotype for inhibitors of the cysteine protease cathepsin K. J Med Chem50:591-4 (2007) 
 
Procathepsin L
Name:Procathepsin L
Type:Enzyme
Mol. Mass.:37557.19
Organism:Homo sapiens (Human)
Description:Purchased from Calbiochem (San Diego, CA).
Residue:333
BDBM19742
BDBM19485
NameBDBM19742
Synonyms:2-Cyano-pyrimidine, 17g | 2-cyano-4-[(2,2-dimethylpropyl)amino]-N-(2-{4-[(1-methylpiperidin-4-yl)oxy]phenyl}ethyl)pyrimidine-5-carboxamide
TypeSmall organic molecule
Emp. Form.C25H34N6O2
Mol. Mass.450.5765
SMILESCN1CCC(CC1)Oc1ccc(CCNC(=O)c2cnc(nc2NCC(C)(C)C)C#N)cc1