Reaction Details
TargetProcathepsin L
LigandBDBM19745
Substrate/CompetitorBDBM19485
Meas. Tech.Enzyme Inhibition Assay
pH5.5±n/a
Temperature295.15±n/a K
IC50 0.58±n/a nM
Km850±n/a nM
Citation Altmann, EAichholz, RBetschart, CBuhl, TGreen, JIrie, OTeno, NLattmann, RTintelnot-Blomley, MMissbach, M 2-Cyano-pyrimidines: a new chemotype for inhibitors of the cysteine protease cathepsin K. J Med Chem50:591-4 (2007) 
 
Procathepsin L
Name:Procathepsin L
Type:Enzyme
Mol. Mass.:37557.19
Organism:Homo sapiens (Human)
Description:Purchased from Calbiochem (San Diego, CA).
Residue:333
BDBM19745
BDBM19485
NameBDBM19745
Synonyms:2-Cyano-pyrimidine, 17j | 2-cyano-4-[(2,2-dimethylpropyl)amino]-N-(2-{3-[2-(1H-imidazol-1-yl)ethoxy]-4-methoxyphenyl}ethyl)pyrimidine-5-carboxamide
TypeSmall organic molecule
Emp. Form.C25H31N7O3
Mol. Mass.477.5587
SMILESCOc1ccc(CCNC(=O)c2cnc(nc2NCC(C)(C)C)C#N)cc1OCCn1ccnc1