Reaction Details
TargetCathepsin S
LigandBDBM19737
Substrate/CompetitorBDBM19963
Meas. Tech.Enzyme Inhibition Assay
IC50 0.9±n/a nM
Citation Altmann, EAichholz, RBetschart, CBuhl, TGreen, JIrie, OTeno, NLattmann, RTintelnot-Blomley, MMissbach, M 2-Cyano-pyrimidines: a new chemotype for inhibitors of the cysteine protease cathepsin K. J Med Chem50:591-4 (2007) 
 
Cathepsin S
Name:Cathepsin S
Type:Protein
Mol. Mass.:37507.38
Organism:Homo sapiens (Human)
Description:P25774
Residue:331
BDBM19737
BDBM19963
NameBDBM19737
Synonyms:2-Cyano-pyrimidine, 17b | 2-cyano-4-[(2,2-dimethylpropyl)amino]-N-[2-(3-methoxyphenyl)ethyl]pyrimidine-5-carboxamide
TypeSmall organic molecule
Emp. Form.C20H25N5O2
Mol. Mass.367.4448
SMILESCOc1cccc(CCNC(=O)c2cnc(nc2NCC(C)(C)C)C#N)c1