Reaction Details
TargetNuclear receptor ROR-gamma
LigandBDBM362840
Substrate/Competitorn/a
Meas. Tech.Binding Assay
Ki<100±n/a nM
Citation Claremon, DADillard, LWDong, CFan, YJia, LLotesta, SDMarcus, ASingh, SBTice, CMYuan, JZhao, WZheng, YZhuang, L Isoindoline inhibitors of ROR-gamma US Patent US9845308 Publication Date 12/19/2017
 
Nuclear receptor ROR-gamma
Name:Nuclear receptor ROR-gamma
Type:Enzyme Catalytic Domain
Mol. Mass.:58218.40
Organism:Homo sapiens (Human)
Description:P51449
Residue:518
BDBM362840
NameBDBM362840
Synonyms:N-((5-(ethylsulfonyl)pyridin-2-yl)methyl)-1-isopropyl-2-((trans-4-(trifluoromethyl)cyclohexyl)methyl)isoindoline-5-carboxamide (1a) and (1b) | US9845308, Example 1a
TypeSmall organic molecule
Emp. Form.C28H36F3N3O3S
Mol. Mass.551.664
SMILESCCS(=O)(=O)c1ccc(CNC(=O)c2ccc3[C@H](C(C)C)N(C[C@H]4CC[C@@H](CC4)C(F)(F)F)Cc3c2)nc1