Reaction Details
TargetNuclear receptor ROR-gamma
LigandBDBM362866
Substrate/Competitorn/a
Meas. Tech.Binding Assay
Ki<100±n/a nM
Citation Claremon, DADillard, LWDong, CFan, YJia, LLotesta, SDMarcus, ASingh, SBTice, CMYuan, JZhao, WZheng, YZhuang, L Isoindoline inhibitors of ROR-gamma US Patent US9845308 Publication Date 12/19/2017
 
Nuclear receptor ROR-gamma
Name:Nuclear receptor ROR-gamma
Type:Enzyme Catalytic Domain
Mol. Mass.:58218.40
Organism:Homo sapiens (Human)
Description:P51449
Residue:518
BDBM362866
NameBDBM362866
Synonyms:US9845308, Example 3c
TypeSmall organic molecule
Emp. Form.C30H39F3N2O4S
Mol. Mass.580.702
SMILESCCS(=O)(=O)c1ccc(cc1)[C@@H](CO)NC(=O)c1ccc2[C@H](C(C)C)N(C[C@H]3CC[C@@H](CC3)C(F)(F)F)Cc2c1