Reaction Details
TargetCathepsin K
LigandBDBM19764
Substrate/CompetitorBDBM19485
Meas. Tech.Enzyme Inhibition Assay
pH7±n/a
Temperature295.15±n/a K
IC50<1±n/a nM
Citation Altmann, EAichholz, RBetschart, CBuhl, TGreen, JLattmann, RMissbach, M Dipeptide nitrile inhibitors of cathepsin K. Bioorg Med Chem Lett16:2549-54 (2006) 
 
Cathepsin K
Name:Cathepsin K
Type:Enzyme
Mol. Mass.:36975.68
Organism:Homo sapiens (Human)
Description:P43235
Residue:329
BDBM19764
BDBM19485
NameBDBM19764
Synonyms:(2S)-N-[(1R)-2-(benzyloxy)-1-cyanoethyl]-2-(1H-indol-2-ylformamido)-4-methylpentanamide | dipeptidyl nitrile, 16e
TypeSmall organic molecule
Emp. Form.C25H28N4O3
Mol. Mass.432.5148
SMILESCC(C)C[C@H](NC(=O)c1cc2ccccc2[nH]1)C(=O)N[C@@H](COCc1ccccc1)C#N