Reaction Details
TargetCathepsin S
LigandBDBM19778
Substrate/CompetitorBDBM19485
Meas. Tech.Enzyme Inhibition Assay
Ki 1.6±n/a nM
Citation Yamashita, DSMarquis, RWXie, RNidamarthy, SDOh, HJJeong, JUErhard, KFWard, KWRoethke, TJSmith, BRCheng, HYGeng, XLin, FOffen, PHWang, BNevins, NHead, MSHaltiwanger, RCNarducci Sarjeant, AALiable-Sands, LMZhao, BSmith, WWJanson, CAGao, ETomaszek, TMcQueney, MJames, IEGress, CJZembryki, DLLark, MWVeber, DF Structure activity relationships of 5-, 6-, and 7-methyl-substituted azepan-3-one cathepsin K inhibitors. J Med Chem49:1597-612 (2006) 
 
Cathepsin S
Name:Cathepsin S
Type:Protein
Mol. Mass.:37507.38
Organism:Homo sapiens (Human)
Description:P25774
Residue:331
BDBM19778
BDBM19485
NameBDBM19778
Synonyms:(2S)-2-(1-benzofuran-2-ylformamido)-4-methyl-N-[(4S,7R)-7-methyl-3-oxo-1-(pyridine-2-sulfonyl)azepan-4-yl]pentanamide CHEMBL203665
TypeSmall organic molecule
Emp. Form.C27H32N4O6S
Mol. Mass.540.631
SMILESCC(C)C[C@H](NC(=O)c1cc2ccccc2o1)C(=O)N[C@H]1CC[C@@H](C)N(CC1=O)S(=O)(=O)c1ccccn1