Reaction Details
TargetSodium channel protein type 9 subunit alpha
LigandBDBM258122
Substrate/Competitorn/a
Meas. Tech.Electrophysiological Assay
IC50 23.0±n/a nM
Citation Shinozuka, TKobayashi, HSuzuki, STanaka, KKimoto, HDomon, Y Cycloalkane derivatives US Patent US9845313 Publication Date 12/19/2017
 
Sodium channel protein type 9 subunit alpha
Name:Sodium channel protein type 9 subunit alpha
Type:Protein
Mol. Mass.:226375.97
Organism:Homo sapiens (Human)
Description:Q15858
Residue:1988
BDBM258122
NameBDBM258122
Synonyms:US9493448, 24 | US9845313, Example 24
TypeSmall organic molecule
Emp. Form.C19H18F3N5O3S
Mol. Mass.453.438
SMILESCn1nccc1[C@H]1CCC[C@@H]1Oc1cc(F)c(cc1F)S(=O)(=O)Nc1ccnc(F)n1