Reaction Details
TargetSodium channel protein type 9 subunit alpha
LigandBDBM258220
Substrate/Competitorn/a
Meas. Tech.Electrophysiological Assay
IC50 21.0±n/a nM
Citation Shinozuka, TKobayashi, HSuzuki, STanaka, KKimoto, HDomon, Y Cycloalkane derivatives US Patent US9845313 Publication Date 12/19/2017
 
Sodium channel protein type 9 subunit alpha
Name:Sodium channel protein type 9 subunit alpha
Type:Protein
Mol. Mass.:226375.97
Organism:Homo sapiens (Human)
Description:Q15858
Residue:1988
BDBM258220
NameBDBM258220
Synonyms:US9493448, 127 US9597330, Example 48 | US9845313, Example 143
TypeSmall organic molecule
Emp. Form.C20H20F3N5O3S
Mol. Mass.467.465
SMILESCc1cc(c(F)cc1O[C@H]1CC(F)(F)CC[C@@H]1c1cn[nH]c1)S(=O)(=O)Nc1ccncn1