Reaction Details
TargetSodium channel protein type 9 subunit alpha
LigandBDBM363077
Substrate/Competitorn/a
Meas. Tech.Electrophysiological Assay
IC50 28.0±n/a nM
Citation Shinozuka, TKobayashi, HSuzuki, STanaka, KKimoto, HDomon, Y Cycloalkane derivatives US Patent US9845313 Publication Date 12/19/2017
 
Sodium channel protein type 9 subunit alpha
Name:Sodium channel protein type 9 subunit alpha
Type:Protein
Mol. Mass.:226375.97
Organism:Homo sapiens (Human)
Description:Q15858
Residue:1988
BDBM363077
NameBDBM363077
Synonyms:5-Chloro-2-fluoro-4-{[(1S,2R)-2-(1H-pyrazol-5-yl)cyclohexyl]oxy}-N-(pyrimidin-4-yl)benzenesulfonamide | US9845313, Example 158
TypeSmall organic molecule
Emp. Form.C19H20ClFN5O3S
Mol. Mass.452.91
SMILESFc1cc(O[C@H]2CCCC[C@@H]2c2ccn[nH]2)c(Cl)cc1S(=O)(=O)Nc1cc[nH]cn1