Reaction Details
TargetCathepsin K
LigandBDBM19799
Substrate/CompetitorBDBM19485
Meas. Tech.In Vitro Enzyme Inhibition Assay
pH5.5±n/a
Temperature295.15±n/a K
Ki 150±n/a nM
Citation Marquis, RWRu, YZeng, JTrout, RELoCastro, SMGribble, ADWitherington, JFenwick, AEGarnier, BTomaszek, TTew, DHemling, MEQuinn, CJSmith, WWZhao, BMcQueney, MSJanson, CAD'Alessio, KVeber, DF Cyclic ketone inhibitors of the cysteine protease cathepsin K. J Med Chem44:725-36 (2001) 
 
Cathepsin K
Name:Cathepsin K
Type:Enzyme
Mol. Mass.:36975.68
Organism:Homo sapiens (Human)
Description:P43235
Residue:329
BDBM19799
BDBM19485
NameBDBM19799
Synonyms:4-amidotetrahydropyran-3-one, 4 | benzyl N-[(1S)-3-methyl-1-[(3-oxooxan-4-yl)carbamoyl]butyl]carbamate
TypeSmall organic molecule
Emp. Form.C19H26N2O5
Mol. Mass.362.4201
SMILESCC(C)C[C@H](NC(=O)OCc1ccccc1)C(=O)NC1CCOCC1=O