Reaction Details
TargetCathepsin K
LigandBDBM19805
Substrate/CompetitorBDBM19485
Meas. Tech.In Vitro Enzyme Inhibition Assay
pH5.5±n/a
Temperature295.15±n/a K
Ki 250±n/a nM
Citation Marquis, RWRu, YZeng, JTrout, RELoCastro, SMGribble, ADWitherington, JFenwick, AEGarnier, BTomaszek, TTew, DHemling, MEQuinn, CJSmith, WWZhao, BMcQueney, MSJanson, CAD'Alessio, KVeber, DF Cyclic ketone inhibitors of the cysteine protease cathepsin K. J Med Chem44:725-36 (2001) 
 
Cathepsin K
Name:Cathepsin K
Type:Enzyme
Mol. Mass.:36975.68
Organism:Homo sapiens (Human)
Description:P43235
Residue:329
BDBM19805
BDBM19485
NameBDBM19805
Synonyms:benzyl N-[(1S)-1-[(1-acetyl-4-oxopyrrolidin-3-yl)carbamoyl]-3-methylbutyl]carbamate | pyrrolidinone analogue, 22
TypeSmall organic molecule
Emp. Form.C20H27N3O5
Mol. Mass.389.4455
SMILESCC(C)C[C@H](NC(=O)OCc1ccccc1)C(=O)NC1CN(CC1=O)C(C)=O