Reaction Details
TargetCathepsin K
LigandBDBM19811
Substrate/CompetitorBDBM19485
Meas. Tech.In Vitro Enzyme Inhibition Assay
pH5.5±n/a
Temperature295.15±n/a K
Ki 1.9±n/a nM
Citation Marquis, RWRu, YZeng, JTrout, RELoCastro, SMGribble, ADWitherington, JFenwick, AEGarnier, BTomaszek, TTew, DHemling, MEQuinn, CJSmith, WWZhao, BMcQueney, MSJanson, CAD'Alessio, KVeber, DF Cyclic ketone inhibitors of the cysteine protease cathepsin K. J Med Chem44:725-36 (2001) 
 
Cathepsin K
Name:Cathepsin K
Type:Enzyme
Mol. Mass.:36975.68
Organism:Homo sapiens (Human)
Description:P43235
Residue:329
BDBM19811
BDBM19485
NameBDBM19811
Synonyms:benzyl N-[(1S)-1-({1-[(2S)-2-{[(benzyloxy)carbonyl](methyl)amino}-4-methylpentanoyl]-3-oxopiperidin-4-yl}carbamoyl)-3-methylbutyl]carbamate | piperidinone analogue, 28
TypeSmall organic molecule
Emp. Form.C34H46N4O7
Mol. Mass.622.7516
SMILESCC(C)C[C@H](NC(=O)OCc1ccccc1)C(=O)NC1CCN(CC1=O)C(=O)[C@H](CC(C)C)N(C)C(=O)OCc1ccccc1