Reaction Details
TargetProcathepsin L
LigandBDBM19804
Substrate/CompetitorBDBM19485
Meas. Tech.In Vitro Enzyme Inhibition Assay
Ki 250±n/a nM
Citation Marquis, RWRu, YZeng, JTrout, RELoCastro, SMGribble, ADWitherington, JFenwick, AEGarnier, BTomaszek, TTew, DHemling, MEQuinn, CJSmith, WWZhao, BMcQueney, MSJanson, CAD'Alessio, KVeber, DF Cyclic ketone inhibitors of the cysteine protease cathepsin K. J Med Chem44:725-36 (2001) 
 
Procathepsin L
Name:Procathepsin L
Type:Enzyme
Mol. Mass.:37557.19
Organism:Homo sapiens (Human)
Description:Purchased from Calbiochem (San Diego, CA).
Residue:333
BDBM19804
BDBM19485
NameBDBM19804
Synonyms:(2S)-4-methyl-N-(4-oxooxolan-3-yl)-2-(quinolin-2-ylformamido)pentanamide CHEMBL62239
TypeSmall organic molecule
Emp. Form.C20H23N3O4
Mol. Mass.369.4143
SMILESCC(C)C[C@H](NC(=O)c1ccc2ccccc2n1)C(=O)NC1COCC1=O