Reaction Details
TargetCathepsin S
LigandBDBM19807
Substrate/CompetitorBDBM19490
Meas. Tech.In Vitro Enzyme Inhibition Assay
Ki 90±n/a nM
Citation Marquis, RWRu, YZeng, JTrout, RELoCastro, SMGribble, ADWitherington, JFenwick, AEGarnier, BTomaszek, TTew, DHemling, MEQuinn, CJSmith, WWZhao, BMcQueney, MSJanson, CAD'Alessio, KVeber, DF Cyclic ketone inhibitors of the cysteine protease cathepsin K. J Med Chem44:725-36 (2001) 
 
Cathepsin S
Name:Cathepsin S
Type:Protein
Mol. Mass.:37507.38
Organism:Homo sapiens (Human)
Description:P25774
Residue:331
BDBM19807
BDBM19490
NameBDBM19807
Synonyms:CHEMBL100563 pyrrolidinone analogue, 24
TypeSmall organic molecule
Emp. Form.C32H42N4O7
Mol. Mass.594.6985
SMILESCC(C)C[C@H](NC(=O)OCc1ccccc1)C(=O)NC1CN(CC1=O)C(=O)[C@H](CC(C)C)NC(=O)OCc1ccccc1