Reaction Details
TargetCathepsin K
LigandBDBM19819
Substrate/CompetitorBDBM19480
Meas. Tech.Enzyme Inhibition Assay
pH5.5±n/a
Temperature295.15±n/a K
IC50 30±n/a nM
Citation Crane, SNBlack, WCPalmer, JTDavis, DESetti, ERobichaud, JPaquet, JOballa, RMBayly, CIMcKay, DJSomoza, JRChauret, NSeto, CScheigetz, JWesolowski, GMassé, FDesmarais, SOuellet, M Beta-substituted cyclohexanecarboxamide: a nonpeptidic framework for the design of potent inhibitors of cathepsin K. J Med Chem49:1066-79 (2006) 
 
Cathepsin K
Name:Cathepsin K
Type:Enzyme
Mol. Mass.:36879.51
Organism:Oryctolagus cuniculus (rabbit)
Description:n/a
Residue:329
BDBM19819
BDBM19480
NameBDBM19819
Synonyms:(1R,2R)-2-{[(4-chlorophenyl)sulfanyl]methyl}-N-(cyanomethyl)cyclohexane-1-carboxamide racemic mixture
TypeSmall organic molecule
Emp. Form.C16H19ClN2OS
Mol. Mass.322.853
SMILESClc1ccc(SC[C@@H]2CCCC[C@H]2C(=O)NCC#N)cc1