Reaction Details
TargetCathepsin K
LigandBDBM19837
Substrate/CompetitorBDBM19480
Meas. Tech.Enzyme Inhibition Assay
pH5.5±n/a
Temperature295.15±n/a K
IC50 410±n/a nM
Citation Crane, SNBlack, WCPalmer, JTDavis, DESetti, ERobichaud, JPaquet, JOballa, RMBayly, CIMcKay, DJSomoza, JRChauret, NSeto, CScheigetz, JWesolowski, GMassé, FDesmarais, SOuellet, M Beta-substituted cyclohexanecarboxamide: a nonpeptidic framework for the design of potent inhibitors of cathepsin K. J Med Chem49:1066-79 (2006) 
 
Cathepsin K
Name:Cathepsin K
Type:Enzyme
Mol. Mass.:36879.51
Organism:Oryctolagus cuniculus (rabbit)
Description:n/a
Residue:329
BDBM19837
BDBM19480
NameBDBM19837
Synonyms:(1R,2R)-N-(cyanomethyl)-2-[(1H-imidazol-2-ylsulfanyl)methyl]cyclohexane-1-carboxamide racemic mixture
TypeSmall organic molecule
Emp. Form.C13H18N4OS
Mol. Mass.278.373
SMILESO=C(NCC#N)[C@@H]1CCCC[C@H]1CSc1ncc[nH]1