Reaction Details
TargetCathepsin K
LigandBDBM19838
Substrate/CompetitorBDBM19480
Meas. Tech.Enzyme Inhibition Assay
pH5.5±n/a
Temperature295.15±n/a K
IC50 200±n/a nM
Citation Crane, SNBlack, WCPalmer, JTDavis, DESetti, ERobichaud, JPaquet, JOballa, RMBayly, CIMcKay, DJSomoza, JRChauret, NSeto, CScheigetz, JWesolowski, GMassé, FDesmarais, SOuellet, M Beta-substituted cyclohexanecarboxamide: a nonpeptidic framework for the design of potent inhibitors of cathepsin K. J Med Chem49:1066-79 (2006) 
 
Cathepsin K
Name:Cathepsin K
Type:Enzyme
Mol. Mass.:36879.51
Organism:Oryctolagus cuniculus (rabbit)
Description:n/a
Residue:329
BDBM19838
BDBM19480
NameBDBM19838
Synonyms:(1R,2R)-2-[(1,3-benzothiazol-2-ylsulfanyl)methyl]-N-(cyanomethyl)cyclohexane-1-carboxamide racemic mixture
TypeSmall organic molecule
Emp. Form.C17H19N3OS2
Mol. Mass.345.482
SMILESO=C(NCC#N)[C@@H]1CCCC[C@H]1CSc1nc2ccccc2s1