Reaction Details
TargetCathepsin K
LigandBDBM19843
Substrate/CompetitorBDBM19480
Meas. Tech.Enzyme Inhibition Assay
pH5.5±n/a
Temperature295.15±n/a K
IC50 5.0±n/a nM
Citation Crane, SNBlack, WCPalmer, JTDavis, DESetti, ERobichaud, JPaquet, JOballa, RMBayly, CIMcKay, DJSomoza, JRChauret, NSeto, CScheigetz, JWesolowski, GMassé, FDesmarais, SOuellet, M Beta-substituted cyclohexanecarboxamide: a nonpeptidic framework for the design of potent inhibitors of cathepsin K. J Med Chem49:1066-79 (2006) 
 
Cathepsin K
Name:Cathepsin K
Type:Enzyme
Mol. Mass.:36879.51
Organism:Oryctolagus cuniculus (rabbit)
Description:n/a
Residue:329
BDBM19843
BDBM19480
NameBDBM19843
Synonyms:(1R,2R)-N-(cyanomethyl)-2-({[4-(methylsulfanyl)benzene]sulfonyl}methyl)cyclohexane-1-carboxamide racemic mixture
TypeSmall organic molecule
Emp. Form.C17H22N2O3S2
Mol. Mass.366.498
SMILESCSc1ccc(cc1)S(=O)(=O)C[C@@H]1CCCC[C@H]1C(=O)NCC#N