Reaction Details
TargetCathepsin K
LigandBDBM19850
Substrate/CompetitorBDBM19480
Meas. Tech.Enzyme Inhibition Assay
IC50 36±n/a nM
Citation Crane, SNBlack, WCPalmer, JTDavis, DESetti, ERobichaud, JPaquet, JOballa, RMBayly, CIMcKay, DJSomoza, JRChauret, NSeto, CScheigetz, JWesolowski, GMassé, FDesmarais, SOuellet, M Beta-substituted cyclohexanecarboxamide: a nonpeptidic framework for the design of potent inhibitors of cathepsin K. J Med Chem49:1066-79 (2006) 
 
Cathepsin K
Name:Cathepsin K
Type:Enzyme
Mol. Mass.:36879.51
Organism:Oryctolagus cuniculus (rabbit)
Description:n/a
Residue:329
BDBM19850
BDBM19480
NameBDBM19850
Synonyms:(1R,2R)-N-(cyanomethyl)-5,5-difluoro-2-[2-(4-fluorophenyl)phenyl]cyclohexane-1-carboxamide racemic mixture
TypeSmall organic molecule
Emp. Form.C21H19F3N2O
Mol. Mass.372.3836
SMILESFc1ccc(cc1)-c1ccccc1[C@@H]1CCC(F)(F)C[C@H]1C(=O)NCC#N