Reaction Details
TargetCathepsin K
LigandBDBM19853
Substrate/CompetitorBDBM19480
Meas. Tech.Enzyme Inhibition Assay
IC50 3.7±n/a nM
Citation Crane, SNBlack, WCPalmer, JTDavis, DESetti, ERobichaud, JPaquet, JOballa, RMBayly, CIMcKay, DJSomoza, JRChauret, NSeto, CScheigetz, JWesolowski, GMassé, FDesmarais, SOuellet, M Beta-substituted cyclohexanecarboxamide: a nonpeptidic framework for the design of potent inhibitors of cathepsin K. J Med Chem49:1066-79 (2006) 
 
Cathepsin K
Name:Cathepsin K
Type:Enzyme
Mol. Mass.:36879.51
Organism:Oryctolagus cuniculus (rabbit)
Description:n/a
Residue:329
BDBM19853
BDBM19480
NameBDBM19853
Synonyms:(1R,2R,5R)-N-(cyanomethyl)-5-fluoro-2-{2-[4-(methylsulfanyl)phenyl]phenyl}cyclohexane-1-carboxamide racemic mixture
TypeSmall organic molecule
Emp. Form.C22H23FN2OS
Mol. Mass.382.494
SMILESCSc1ccc(cc1)-c1ccccc1[C@@H]1CC[C@@H](F)C[C@H]1C(=O)NCC#N