Reaction Details
TargetP2X purinoceptor 3
LigandBDBM244285
Substrate/Competitorn/a
Meas. Tech.Receptor Inhibition Assay
pH7.5±n/a
IC50 1.000±n/a nM
Commentsextracted
Citation Kai, HTanaka, SHiramatsu, YNozu, ANakamura, K Heterocyclic ring and carbocyclic derivative US Patent US9550763 Publication Date 1/24/2017
 
P2X purinoceptor 3
Name:P2X purinoceptor 3
Type:Protein
Mol. Mass.:44292.02
Organism:Homo sapiens (Human)
Description:P56373
Residue:397
BDBM244285
NameBDBM244285
Synonyms:US9550763, Compound I-033
TypeSmall organic molecule
Emp. Form.C25H20ClFN4O5
Mol. Mass.510.902
SMILESCCn1c(=O)cc(Nc2ccc(Oc3cccc(n3)C(O)=O)c(F)c2)n(Cc2ccc(Cl)cc2)c1=O