Reaction Details
TargetMitogen-activated protein kinase kinase kinase kinase 4
LigandBDBM225895
Substrate/Competitorn/a
Meas. Tech.Inhibition Assay
IC50 88.4±n/a nM
Citation Chen, HCrawford, THarris, SFMagnuson, SRNbdubaku, CWang, L Aminoquinazoline and pyridopyrimidine derivatives US Patent US9855269 Publication Date 1/2/2018
 
Mitogen-activated protein kinase kinase kinase kinase 4
Name:Mitogen-activated protein kinase kinase kinase kinase 4
Type:Serine/threonine-protein kinase
Mol. Mass.:142114.73
Organism:Homo sapiens (Human)
Description:O95819
Residue:1239
BDBM225895
NameBDBM225895
Synonyms:MAP14 US9855269, Compound 38
TypeSmall Organic Molecule
Emp. Form.C19H20FN5O
Mol. Mass.353.3934
SMILESCN(C)CCC(=O)Nc1cc(F)cc(c1)-c1ccc2ncnc(N)c2c1