Reaction Details
TargetMitogen-activated protein kinase kinase kinase kinase 4
LigandBDBM299412
Substrate/Competitorn/a
Meas. Tech.Inhibition Assay
IC50 148±n/a nM
Citation Chen, HCrawford, THarris, SFMagnuson, SRNbdubaku, CWang, L Aminoquinazoline and pyridopyrimidine derivatives US Patent US9855269 Publication Date 1/2/2018
 
Mitogen-activated protein kinase kinase kinase kinase 4
Name:Mitogen-activated protein kinase kinase kinase kinase 4
Type:Serine/threonine-protein kinase
Mol. Mass.:142114.73
Organism:Homo sapiens (Human)
Description:O95819
Residue:1239
BDBM299412
NameBDBM299412
Synonyms:6-(2-methyl- 4-pyridyl) quinazolin- 4-amine US9855269, Compound 52
TypeSmall organic molecule
Emp. Form.C14H12N4
Mol. Mass.236.2719
SMILESCc1cc(ccn1)-c1ccc2ncnc(N)c2c1