Reaction Details
TargetMitogen-activated protein kinase kinase kinase kinase 4
LigandBDBM299544
Substrate/Competitorn/a
Meas. Tech.Inhibition Assay
IC50 7.25±n/a nM
Citation Chen, HCrawford, THarris, SFMagnuson, SRNbdubaku, CWang, L Aminoquinazoline and pyridopyrimidine derivatives US Patent US9855269 Publication Date 1/2/2018
 
Mitogen-activated protein kinase kinase kinase kinase 4
Name:Mitogen-activated protein kinase kinase kinase kinase 4
Type:Serine/threonine-protein kinase
Mol. Mass.:142114.73
Organism:Homo sapiens (Human)
Description:O95819
Residue:1239
BDBM299544
NameBDBM299544
Synonyms:N-[3-(4-amino- pyrido[3,2-d] pyrimidin- 6-yl)-5-fluoro- phenyl]-2- pyrrolidin-1-yl- acetamide US9855269, Compound 163
TypeSmall organic molecule
Emp. Form.C19H19FN6O
Mol. Mass.366.3922
SMILESNc1ncnc2ccc(nc12)-c1cc(F)cc(NC(=O)CN2CCCC2)c1