Reaction Details
TargetMitogen-activated protein kinase kinase kinase kinase 4
LigandBDBM225901
Substrate/Competitorn/a
Meas. Tech.Inhibition Assay
IC50 3.11±n/a nM
Citation Chen, HCrawford, THarris, SFMagnuson, SRNbdubaku, CWang, L Aminoquinazoline and pyridopyrimidine derivatives US Patent US9855269 Publication Date 1/2/2018
 
Mitogen-activated protein kinase kinase kinase kinase 4
Name:Mitogen-activated protein kinase kinase kinase kinase 4
Type:Serine/threonine-protein kinase
Mol. Mass.:142114.73
Organism:Homo sapiens (Human)
Description:O95819
Residue:1239
BDBM225901
NameBDBM225901
Synonyms:MAP19 | US9855269, Compound 342
TypeSmall Organic Molecule
Emp. Form.C17H14N6
Mol. Mass.302.3333
SMILESCc1c[nH]nc1-c1cccc(c1)-c1ccc2ncnc(N)c2n1