Reaction Details
TargetVoltage-dependent T-type calcium channel subunit alpha-1H
LigandBDBM363976
Substrate/Competitorn/a
Meas. Tech.Activity Assay
IC50 3.00±n/a nM
Citation Masaki, HIwasaki, YKageyama, MUchino, Y Substituted tropane derivatives US Patent US9856250 Publication Date 1/2/2018
 
Voltage-dependent T-type calcium channel subunit alpha-1H
Name:Voltage-dependent T-type calcium channel subunit alpha-1H
Type:Enzyme Catalytic Domain
Mol. Mass.:259187.68
Organism:Homo sapiens (Human)
Description:Calcium channel (Type T,L) 0 0::O95180
Residue:2353
BDBM363976
NameBDBM363976
Synonyms:N-[(exo)-8-(tert-Butylcarbamoyl)methyl-8-azabicyclo[3.2.1]octan-3-yl]methylbenzofuran-3-carboxamide | US9856250, 11
TypeSmall organic molecule
Emp. Form.C23H31N3O3
Mol. Mass.397.5105
SMILESCC(C)(C)NC(=O)CN1[C@H]2CC[C@@H]1C[C@@H](CNC(=O)c1coc3ccccc13)C2