Reaction Details
TargetProtein arginine N-methyltransferase 5
LigandBDBM364153
Substrate/Competitorn/a
Meas. Tech.Biochemical Assay
IC50 83.0±n/a nM
Citation Stupple, PAWalker, SRPinson, JLagiakos, HRLunniss, GEHolmes, IPStupple, AEBergman, YEFoitzik, RCKersten, WJCamerino, MA 2-(hetero)aryl-benzimidazole and imidazopyridine derivatives as inhibitors of asparagime emethyl transferase US Patent US9856252 Publication Date 1/2/2018
 
Protein arginine N-methyltransferase 5
Name:Protein arginine N-methyltransferase 5
Type:Enzyme
Mol. Mass.:72679.99
Organism:Homo sapiens (Human)
Description:O14744
Residue:637
BDBM364153
NameBDBM364153
Synonyms:US9856252, 45
TypeSmall organic molecule
Emp. Form.C24H22N4O
Mol. Mass.382.4577
SMILESC(Oc1ccc(cc1)-c1nc2ccc(nc2[nH]1)C1=CCNCC1)c1ccccc1