Reaction Details
TargetLarge envelope protein
LigandBDBM246811
Substrate/Competitorn/a
Meas. Tech.HBsAg assay
Temperature298.15±n/a K
IC50 1.000±n/a nM
Commentsextracted
Citation Han, XJiang, MWang, YYang, S Tetracyclic 4-oxo-pyridine-3-carboxylic acid derivatives for the treatment and prophylaxis of hepatitis B virus infection US Patent US10053461 Publication Date 8/21/2018
 
Large envelope protein
Name:Large envelope protein
Type:n/a
Mol. Mass.:42772.52
Organism:Hepatitis B virus
Description:P03138
Residue:389
BDBM246811
NameBDBM246811
Synonyms:US10053461, 2 cis-10-methoxy-11-(3-methoxypropoxy)-3,3-dimethyl-7-oxo-1,2,3,3a,7,12b-hexahydrocyclopenta[c]pyrido[2,1-a]isoquinoline-6-carboxylic acid
TypeSmall organic molecule
Emp. Form.C24H29NO6
Mol. Mass.427.4902
SMILESCOCCCOc1cc2[C@@H]3CCC(C)(C)[C@@H]3n3cc(C(O)=O)c(=O)cc3-c2cc1OC