Reaction Details
TargetLarge envelope protein
LigandBDBM246824
Substrate/Competitorn/a
Meas. Tech.HBsAg assay
Temperature298.15±n/a K
IC50 6.00±n/a nM
Commentsextracted
Citation Han, XJiang, MWang, YYang, S Tetracyclic 4-oxo-pyridine-3-carboxylic acid derivatives for the treatment and prophylaxis of hepatitis B virus infection US Patent US10053461 Publication Date 8/21/2018
 
Large envelope protein
Name:Large envelope protein
Type:n/a
Mol. Mass.:42772.52
Organism:Hepatitis B virus
Description:P03138
Residue:389
BDBM246824
NameBDBM246824
Synonyms:Cis-10-methoxy-3,3-dimethyl-11-(3-morpholinopropoxy)-7-oxo-1,2,3,3a,7,12b-hexahydrocyclopenta[c]pyrido[2,1-a]isoquinoline-6-carboxylic acid | US10053461, 15
TypeSmall organic molecule
Emp. Form.C27H34N2O6
Mol. Mass.482.5687
SMILESCOc1cc-2c(cc1OCCCN1CCOCC1)[C@H]1CCC(C)(C)[C@H]1n1cc(C(O)=O)c(=O)cc-21