Reaction Details
TargetEstrogen receptor beta
LigandBDBM19441
Substrate/Competitor17beta-estradiol (E2)
Meas. Tech.Estrogen Receptor Binding Assay and Ishikawa Assay
pH7.5±n/a
Temperature295.15±n/a K
Ki 2.74±1.37 nM
EC50 4.32±1.69 nM
Citation Hummel, CWGeiser, AGBryant, HUCohen, IRDally, RDFong, KCFrank, SAHinklin, RJones, SALewis, GMcCann, DJRudmann, DGShepherd, TATian, HWallace, OBWang, MWang, YDodge, JA A selective estrogen receptor modulator designed for the treatment of uterine leiomyoma with unique tissue specificity for uterus and ovaries in rats. J Med Chem48:6772-5 (2005) 
 
Estrogen receptor beta
Name:Estrogen receptor beta
Type:Protein
Mol. Mass.:59238.43
Organism:Homo sapiens (Human)
Description:Q92731
Residue:530
BDBM19441
17beta-estradiol (E2)
NameBDBM19441
Synonyms:2-(4-hydroxyphenyl)-3-({4-[2-(piperidin-1-yl)ethoxy]phenyl}carbonyl)-1-benzothiophen-6-ol Evista RALOXIFENE HYDROCHLORIDE Raloxifene (7) [6-hydroxy-2-(4-hydroxyphenyl)-1-benzothiophen-3-yl]-[4-(2-piperidin-1-ylethoxy)phenyl]methanone | cid_11071264
TypeSmall organic molecule
Emp. Form.C28H27NO4S
Mol. Mass.473.583
SMILESOc1ccc(cc1)-c1sc2cc(O)ccc2c1C(=O)c1ccc(OCCN2CCCCC2)cc1