Reaction Details
TargetEstrogen receptor beta
LigandBDBM19966
Substrate/Competitor17beta-estradiol (E2)
Meas. Tech.Estrogen Receptor Binding Assay and Ishikawa Assay
pH7.5±n/a
Temperature295.15±n/a K
Ki 1.36±0.34 nM
EC50 10.7±6.82 nM
Citation Hummel, CWGeiser, AGBryant, HUCohen, IRDally, RDFong, KCFrank, SAHinklin, RJones, SALewis, GMcCann, DJRudmann, DGShepherd, TATian, HWallace, OBWang, MWang, YDodge, JA A selective estrogen receptor modulator designed for the treatment of uterine leiomyoma with unique tissue specificity for uterus and ovaries in rats. J Med Chem48:6772-5 (2005) 
 
Estrogen receptor beta
Name:Estrogen receptor beta
Type:Protein
Mol. Mass.:59238.43
Organism:Homo sapiens (Human)
Description:Q92731
Residue:530
BDBM19966
17beta-estradiol (E2)
NameBDBM19966
Synonyms:6-(4-methanesulfonylphenyl)-5-{4-[2-(piperidin-1-yl)ethoxy]phenoxy}naphthalen-2-ol CHEMBL243789 LY2066948
TypeSmall organic molecule
Emp. Form.C30H31NO5S
Mol. Mass.517.636
SMILESCS(=O)(=O)c1ccc(cc1)-c1ccc2cc(O)ccc2c1Oc1ccc(OCCN2CCCCC2)cc1