Reaction Details
TargetEstrogen receptor
LigandBDBM19970
Substrate/Competitor17beta-estradiol (E2)
Meas. Tech.Estrogen Receptor Binding Assay.
pH7.5±n/a
Temperature295.15±n/a K
Ki 126±82 nM
Citation Richardson, TINorman, BHLugar, CWJones, SAWang, YDurbin, JDKrishnan, VDodge, JA Benzopyrans as selective estrogen receptor beta agonists (SERBAs). Part 2: structure-activity relationship studies on the benzopyran scaffold. Bioorg Med Chem Lett17:3570-4 (2007) 
 
Estrogen receptor
Name:Estrogen receptor
Type:Protein
Mol. Mass.:66230.44
Organism:Homo sapiens (Human)
Description:P03372
Residue:595
BDBM19970
17beta-estradiol (E2)
NameBDBM19970
Synonyms:(2S)-2-(4-hydroxyphenyl)-3,4-dihydro-2H-1-benzopyran-6-ol racemic mixture
TypeSmall organic molecule
Emp. Form.C15H14O3
Mol. Mass.242.2699
SMILESOc1ccc(cc1)[C@@H]1CCc2cc(O)ccc2O1