Reaction Details
TargetEstrogen receptor
LigandBDBM19977
Substrate/Competitor17beta-estradiol (E2)
Meas. Tech.Estrogen Receptor Binding Assay.
pH7.5±n/a
Temperature295.15±n/a K
Ki 0.35±0.04 nM
Citation Richardson, TINorman, BHLugar, CWJones, SAWang, YDurbin, JDKrishnan, VDodge, JA Benzopyrans as selective estrogen receptor beta agonists (SERBAs). Part 2: structure-activity relationship studies on the benzopyran scaffold. Bioorg Med Chem Lett17:3570-4 (2007) 
 
Estrogen receptor
Name:Estrogen receptor
Type:Protein
Mol. Mass.:66230.44
Organism:Homo sapiens (Human)
Description:P03372
Residue:595
BDBM19977
17beta-estradiol (E2)
NameBDBM19977
Synonyms:(2R,6S,7R)-7-(4-hydroxyphenyl)-8-oxatricyclo[7.4.0.0^{2,6}]trideca-1(9),10,12-trien-13-ol racemic mixture
TypeSmall organic molecule
Emp. Form.C18H18O3
Mol. Mass.282.3337
SMILESOc1ccc(cc1)[C@@H]1Oc2cccc(O)c2[C@@H]2CCC[C@H]12