Reaction Details
TargetEstrogen receptor beta
LigandBDBM19973
Substrate/Competitor17beta-estradiol (E2)
Meas. Tech.Estrogen Receptor Binding Assay.
pH7.5±n/a
Temperature295.15±n/a K
Ki 0.88±0.38 nM
Citation Richardson, TINorman, BHLugar, CWJones, SAWang, YDurbin, JDKrishnan, VDodge, JA Benzopyrans as selective estrogen receptor beta agonists (SERBAs). Part 2: structure-activity relationship studies on the benzopyran scaffold. Bioorg Med Chem Lett17:3570-4 (2007) 
 
Estrogen receptor beta
Name:Estrogen receptor beta
Type:Protein
Mol. Mass.:59238.43
Organism:Homo sapiens (Human)
Description:Q92731
Residue:530
BDBM19973
17beta-estradiol (E2)
NameBDBM19973
Synonyms:(1R,9R,10S)-9-(4-hydroxyphenyl)-8-oxatricyclo[8.5.0.0^{2,7}]pentadeca-2(7),3,5-trien-4-ol racemic mixture
TypeSmall organic molecule
Emp. Form.C20H22O3
Mol. Mass.310.3869
SMILESOc1ccc(cc1)[C@@H]1Oc2ccc(O)cc2[C@@H]2CCCCC[C@H]12