Reaction Details
TargetEstrogen receptor beta
LigandBDBM19985
Substrate/Competitor17beta-estradiol (E2)
Meas. Tech.Estrogen Receptor Binding Assay.
pH7.5±n/a
Temperature295.15±n/a K
Ki 0.31±0.19 nM
Citation Richardson, TIDodge, JADurst, GLPfeifer, LAShah, JWang, YDurbin, JDKrishnan, VNorman, BH Benzopyrans as selective estrogen receptor beta agonists (SERBAs). Part 3: synthesis of cyclopentanone and cyclohexanone intermediates for C-ring modification. Bioorg Med Chem Lett17:4824-8 (2007) 
 
Estrogen receptor beta
Name:Estrogen receptor beta
Type:Protein
Mol. Mass.:59238.43
Organism:Homo sapiens (Human)
Description:Q92731
Residue:530
BDBM19985
17beta-estradiol (E2)
NameBDBM19985
Synonyms:(2R,4S,6S,7R)-7-(4-hydroxyphenyl)-4-methyl-8-oxatricyclo[7.4.0.0^{2,6}]trideca-1(9),10,12-trien-12-ol | C-ring modified benzopyran scaffold, 2e
TypeSmall organic molecule
Emp. Form.C19H20O3
Mol. Mass.296.3603
SMILES[H][C@@]1(C)C[C@H]2[C@@H](C1)c1cc(O)ccc1O[C@H]2c1ccc(O)cc1