Reaction Details
TargetEstrogen receptor
LigandBDBM19987
Substrate/Competitor17beta-estradiol (E2)
Meas. Tech.Estrogen Receptor Binding Assay.
pH7.5±n/a
Temperature295.15±n/a K
Ki 11.9±5.6 nM
Citation Richardson, TIDodge, JAWang, YDurbin, JDKrishnan, VNorman, BH Benzopyrans as selective estrogen receptor beta agonists (SERBAs). Part 5: Combined A- and C-ring structure-activity relationship studies. Bioorg Med Chem Lett17:5563-6 (2007) 
 
Estrogen receptor
Name:Estrogen receptor
Type:Protein
Mol. Mass.:66230.44
Organism:Homo sapiens (Human)
Description:P03372
Residue:595
BDBM19987
17beta-estradiol (E2)
NameBDBM19987
Synonyms:(2R,6S,7R)-7-(4-hydroxyphenyl)-10-(methoxymethyl)-8-oxatricyclo[7.4.0.0^{2,6}]trideca-1(9),10,12-trien-12-ol BMCL175563 Compound 2a
TypeSmall organic molecule
Emp. Form.C20H22O4
Mol. Mass.326.3863
SMILESCOCc1cc(O)cc2[C@@H]3CCC[C@@H]3[C@@H](Oc12)c1ccc(O)cc1