Reaction Details
TargetP2X purinoceptor 7
LigandBDBM174777
Substrate/Competitorn/a
Meas. Tech.P2X7 Radioligand Binding Assay
Ki 1.30±n/a nM
Citation Letavic, MARudolph, DA P2X7 modulators US Patent US10053462 Publication Date 8/21/2018
 
P2X purinoceptor 7
Name:P2X purinoceptor 7
Type:PROTEIN
Mol. Mass.:68405.16
Organism:Mus musculus
Description:ChEMBL_1473824
Residue:595
BDBM174777
NameBDBM174777
Synonyms:US10053462, 8 US9540388, 8
TypeSmall organic molecule
Emp. Form.C19H15ClF3N5OS
Mol. Mass.453.869
SMILESFC(F)(F)c1cccc(C(=O)N2[C@H]3CCC[C@@H]2c2nnc(-c4cscn4)n2C3)c1Cl