Reaction Details
TargetThymidine phosphorylase
LigandBDBM20057
Substrate/CompetitorBDBM1
Meas. Tech.Enzyme Inhibition Assay
pH6.4±n/a
Temperature310.15±n/a K
Ki 3670±1250 nM
Km121000±19000 nM
Citation Nencka, RVotruba, IHrebabecký, HJansa, PTloust'ova, EHorska, KMasojídkova, MHolý, A Discovery of 5-Substituted-6-chlorouracils as Efficient Inhibitors of Human Thymidine Phosphorylase. J Med Chem50:6016-23 (2007) 
 
Thymidine phosphorylase
Name:Thymidine phosphorylase
Type:Enzyme
Mol. Mass.:49948.87
Organism:Homo sapiens (Human)
Description:The recombinant human thymidine phosphorylase (V79TP) was expressed in V79 Chinese hamster cells (Sigma, T-9319).
Residue:482
BDBM20057
BDBM1
NameBDBM20057
Synonyms:5-Substituted-6-chlorouracil, 5d | 6-chloro-5-pentyl-1,2,3,4-tetrahydropyrimidine-2,4-dione
TypeSmall organic molecule
Emp. Form.C9H13ClN2O2
Mol. Mass.216.665
SMILESCCCCCc1c(Cl)[nH]c(=O)[nH]c1=O