Reaction Details
TargetThymidine phosphorylase
LigandBDBM20072
Substrate/CompetitorBDBM1
Meas. Tech.Enzyme Inhibition Assay
pH6.4±n/a
Temperature310.15±n/a K
Ki 630±90 nM
Km121000±19000 nM
Citation Nencka, RVotruba, IHrebabecký, HJansa, PTloust'ova, EHorska, KMasojídkova, MHolý, A Discovery of 5-Substituted-6-chlorouracils as Efficient Inhibitors of Human Thymidine Phosphorylase. J Med Chem50:6016-23 (2007) 
 
Thymidine phosphorylase
Name:Thymidine phosphorylase
Type:Enzyme
Mol. Mass.:49948.87
Organism:Homo sapiens (Human)
Description:The recombinant human thymidine phosphorylase (V79TP) was expressed in V79 Chinese hamster cells (Sigma, T-9319).
Residue:482
BDBM20072
BDBM1
NameBDBM20072
Synonyms:5-Substituted-6-chlorouracil, 13b | 5-[(1E)-but-1-en-1-yl]-6-chloro-1,2,3,4-tetrahydropyrimidine-2,4-dione
TypeSmall organic molecule
Emp. Form.C8H9ClN2O2
Mol. Mass.200.622
SMILESCCC=Cc1c(Cl)[nH]c(=O)[nH]c1=O